aiguière
terme associe: T69-1360
terme associe: T69-1429
terme associe: T69-1868
terme associe: T69-1871
terme associe: T69-2013
terme associe: T69-2032
terme associe: T69-4100
terme associe: T69-7039
created: 2012-05-16T00:00:00+02:00
modified: 2014-12-08T12:59:59+01:00
status: 1
type: Concept
alternative label: aiguière en casque
alternative label: buire
broader: T69-3889
definition: Récipient verseur, non couvert, à bec et anse latérale, généralement sur un pied élevé, utilisé pour le service de l'eau et du vin sur la table et/ou pour le lavage des mains avant et après le repas.
in scheme: T69
preferred label: ewers (vessels) @en-us
related: T69-1360
related: T69-1429
related: T69-1868
related: T69-1871
related: T69-2013
related: T69-2032
related: T69-4100
related: T69-7039