baril de table
created: 2012-05-16T00:00:00+02:00
modified: 2014-12-08T13:01:01+01:00
status: 1
type: Concept
alternative label: pot Bacchus
broad match: Category:Drinkware
broader: T69-3889
definition: Récipient en métal, céramique ou verre, pour le service de boissons alcoolisées ou de sauces. Il est en forme de tonneau et muni d'un petit robinet ou d'un goulot. Il peut être sur pied.
in scheme: T69
narrow match: http://data.bnf.fr/ark:/12148/cb158795963