biberon d'enfant
created: 2012-05-16T00:00:00+02:00
modified: 2014-12-08T13:05:03+01:00
status: 1
type: Concept
broader: T69-3894
definition: Petite bouteille, en verre, en étain ou en plastique, dont l'extrémité du goulot est munie d'une tétine, destiné à nourrir un nourrisson. Dans le cas de la tétine fixe, le remplissage s'effectue par un orifice pratiqué dans le fond et fermé par un bouchon.
in scheme: T69
preferred label: nursing bottles @en-us