bol
terme associe: T69-3926
created: 2012-05-16T00:00:00+02:00
modified: 2014-12-08T13:06:24+01:00
status: 1
type: Concept
alternative label: bol à bouillon
alternative label: bol à cidre
alternative label: bol à thé
broader: T69-3889
definition: Récipient individuel en bois ou céramique, hémisphérique, non couvert, à fond plat ou sur pied bas et parfois muni d'oreilles latérales horizontales. Il est destiné à la consommation de divers types de boissons.
in scheme: T69
preferred label: bowls @en-us
related: T69-3926