urne cinéraire
created: 2012-05-16T00:00:00+02:00
modified: 2015-02-24T14:46:30+01:00
status: 1
type: Concept
alternative label: urne de cœur
alternative label: urne de viscères
alternative label: urne funéraire
alternative label: étui de cœur
broader: T69-385
definition: Vase couvert destiné à contenir les cendres d'un défunt. Le couvercle peut représenter la tête du défunt et le vase peut prendre un aspect anthropomorphe (statue cinéraire) ou architectural. Il s'agit de l'élément essentiel d'un monument cinéraire.
in scheme: T69
preferred label: cremation urns @en-us
preferred label: urna cineraria @it