bouteille
terme associe: T69-3955
terme associe: T69-4160
terme associe: T69-4168
created: 2012-05-16T00:00:00+02:00
modified: 2014-12-08T13:12:00+01:00
status: 1
type: Concept
alternative label: appareil Lhotte
alternative label: balthazar
alternative label: bouteille bordelaise
alternative label: bouteille bourguignonne
alternative label: bouteille clissée
alternative label: bouteille goutte-à-goutte
alternative label: bouteille à calvados
alternative label: bouteille à cidre
alternative label: bouteille à eau-de-vie
alternative label: bouteille à rafraîchir
alternative label: bouteille à siphon
alternative label: fillette
alternative label: fiole
alternative label: flacon
alternative label: flacon de poche
alternative label: flacon à liqueur
alternative label: flasque
alternative label: jéroboam
alternative label: magnum
alternative label: mathusalem
alternative label: topette
broader: T69-3889
definition: Récipient pour le service puis la conservation et le transport des liquides. La bouteille, de forme, de contenance ou de destination diverses, comporte un goulot supérieur axial fermé par un bouchon. Elle peut être munie d'une ou deux anses latérales verticales. La bouteille en verre peut comporter une doublure extérieure pour la protéger des chocs.
in scheme: T69
preferred label: bottles @en-us
related: T69-3955
related: T69-4160
related: T69-4168