pichet
created: 2012-05-16T00:00:00+02:00
modified: 2014-12-08T13:18:48+01:00
status: 1
type: Concept
alternative label: bouteille à goutte
alternative label: pichet anthropomorphe
alternative label: pichet zoomorphe
alternative label: pot Jacqueline
alternative label: pot à vin
broader: T69-3908
definition: Petit broc en métal, bois, céramique ou verre, servant de mesure. Le pichet est à fond plat ou sur pied bas, muni d'un bec et d'une anse latérale verticale et souvent d'un couvercle à poucier. Les pichets correspondent à des capacités précises, parfois indiquées par une inscription, une marque de niveau ou un élément de structure. Ils sont quelquefois anthropomorphes ou zoomorphes et constituent souvent des séries de dimensions décroissantes.
in scheme: T69
preferred label: pitchers (vessels) @en-us