chopine
created: 2012-05-16T00:00:00+02:00
modified: 2014-12-08T15:52:07+01:00
status: 1
type: Concept
alternative label: moque
broader: T69-3889
definition: Récipient à boire, servant de mesure pour le vin et les alcools et dont la capacité correspond aujourd'hui à un demi-litre. Elle est cylindrique, à fond plat, couverte ou non et munie d'une anse latérale. Les capacités peuvent être indiquées par un chiffre ou une inscription. La pinte équivaut à deux chopines, la quarte à deux pintes. La moque est une petite chopine pour boire du cidre.
in scheme: T69
narrow match: http://data.bnf.fr/ark:/12148/cb120484020
narrower: T69-3918