chope
created: 2012-05-16T00:00:00+02:00
modified: 2014-12-08T15:53:25+01:00
status: 1
type: Concept
broader: T69-3916
definition: Récipient pour boire de la bière, de même forme que la chopine, mais sans capacité précise.
in scheme: T69
preferred label: tankards @en-us