coupe à boire
terme associe: T69-3829
created: 2012-05-16T00:00:00+02:00
modified: 2014-12-08T15:55:15+01:00
status: 1
type: Concept
alternative label: coupe de mariage
alternative label: creusequin
alternative label: mazer
broader: T69-3889
definition: Récipient pour boire, de forme hémisphérique plus ou moins aplatie, qui peut être monté sur un pied et muni ou non d'un couvercle et d'éléments de prise.
in scheme: T69
preferred label: goblets @en-us
related: T69-3829