fontaine à rafraîchir
created: 2012-05-16T00:00:00+02:00
modified: 2014-12-08T15:58:34+01:00
status: 1
type: Concept
broad match: http://data.bnf.fr/ark:/12148/cb144434916
broader: T69-3889
definition: Fontaine comportant une colonne centrale dans laquelle est placée de la glace destinée à rafraîchir la boisson contenue dans le réservoir.
in scheme: T69