plaque funéraire
terme associe: T69-8001
created: 2012-05-16T00:00:00+02:00
modified: 2015-02-24T14:59:24+01:00
status: 1
type: Concept
broad match: Monument funéraire
broad match: http://vocab.getty.edu/aat/300010262
broader: T69-377
definition: Plaque peu épaisse, portant une épitaphe, parfois des armoiries ou un décor, et qui constitue une partie d'un tombeau souvent encastré dans un mur près d'une tombe.
in scheme: T69
preferred label: funerary plaques @en-us
preferred label: lastra sepolcrale @it
related: T69-8001