gourde
terme associe: T69-1772
created: 2012-05-16T00:00:00+02:00
modified: 2014-12-08T16:03:38+01:00
status: 1
type: Concept
alternative label: bouteille de chasse
alternative label: ferrière
alternative label: gourde-baril
alternative label: gourde-calebasse
alternative label: gourde-couronne
broader: T69-3889
definition: Récipient individuel, en forme de bouteille ou de sphère plus ou moins aplatie et parfois complété d’un gobelet, pour transporter et consommer une boisson. Elle est munie de brides, d'une courroie ou d'une chaîne. Elle peut comporter un ou deux goulots, l'un servant à la remplir, l'autre à boire, ou bien correspondant à deux compartiments intérieurs. Sa désignation peut être liée à son utilisateur ou à sa forme.
in scheme: T69
preferred label: canteens (vessels) @en-us
related: T69-1772