goûte-vin
created: 2012-05-16T00:00:00+02:00
modified: 2014-12-08T16:06:14+01:00
status: 1
type: Concept
alternative label: essai à vin
alternative label: goûte-cidre
alternative label: goûte-vin bordelais
alternative label: goûte-vin bourguignon
alternative label: tasse-vin
alternative label: épreuve
broader: T69-3889
definition: Petit récipient bas et circulaire servant à goûter et mirer le vin ou le cidre. Le goûte-vin, en métal, céramique, bois ou verre, est généralement muni sur le bord d'une anse, d'une oreille ou d'un anneau fixe et présente souvent un ombilic, qui peut être décoré en relief.
in scheme: T69
preferred label: wine tasters @en-us