jatte à punch
terme associe: T69-3596
terme associe: T69-3839
terme associe: T69-4024
created: 2012-05-16T00:00:00+02:00
modified: 2014-10-17T10:45:38+02:00
status: 1
type: Concept
alternative label: bol à punch
alternative label: seau à punch
broad match: cb11970743h
broader: T69-3889
definition: Grand récipient circulaire ou seau, en porcelaine, métal ou cristal, parfois sur pied, utilisé pour préparer et servir le punch. Il peut faire partie d’un service à punch.
in scheme: T69
preferred label: punch bowls @en-us
related: T69-3596
related: T69-3839
related: T69-4024