plate-tombe
created: 2012-05-16T00:00:00+02:00
modified: 2015-02-24T15:00:48+01:00
status: 1
type: Concept
broader: T69-377
definition: Monument funéraire situé à l'intérieur d'un édifice, composé d'une dalle funéraire ou d'une lame funéraire fermant la tombe, encastrée dans le sol ou légèrement surélevée par rapport à ce dernier.
in scheme: T69
narrower: T69-396
narrower: T69-399
preferred label: graves @en-us
preferred label: tomba terragna @it