pot à lait
created: 2012-05-16T00:00:00+02:00
modified: 2014-12-08T16:10:29+01:00
status: 1
type: Concept
alternative label: crémier
alternative label: pot à lait de déjeuner
broader: T69-3889
definition: Petit broc en métal, porcelaine ou faïence fine, pour le service du lait ou de la crème de lait que l'on mélange au café, au thé ou au chocolat. A fond plat ou sur pied(s) bas, il est muni d'une anse latérale ou d'un manche. Ce pot fait souvent partie d'un service ou d'un déjeuner.
in scheme: T69
preferred label: milk jugs @en-us