pot trompeur
created: 2012-05-16T00:00:00+02:00
modified: 2014-10-17T10:50:36+02:00
status: 1
type: Concept
alternative label: aiguière trompeuse
alternative label: pichet surprise
alternative label: pot à illusion
broad match: cb12330782p
broader: T69-3889
definition: Récipient en céramique ou en verre, dont le col entièrement ajouré ne permet de boire qu'en aspirant le contenu par le petit goulot horizontal situé sur le bourrelet creux qui forme le rebord de l'ouverture supérieure et communique par l'anse, également creuse, avec le corps du récipient. Le remplissage se fait par un orifice fermé par un bouchon au fond du corps.
in scheme: T69
preferred label: puzzle jugs @en-us