verre d'eau
terme associe: T69-2767
terme associe: T69-3883
terme associe: T69-3904
terme associe: T69-3986
terme associe: T69-4116
created: 2012-05-16T00:00:00+02:00
modified: 2014-12-08T16:20:57+01:00
status: 1
type: Concept
broad match: http://data.bnf.fr/ark:/12148/cb144303016
broader: T69-3889
definition: Ensemble de récipients en verre, généralement individuels, pour boire de l'eau parfumée : il comprend au minimum une carafe et un verre, et peut être complété d’un sucrier, d’une cuillère, d’un plateau etc.
in scheme: T69
related: T69-2767
related: T69-3883
related: T69-3904
related: T69-3986
related: T69-4116