casse-noix
created: 2012-05-16T00:00:00+02:00
modified: 2014-12-05T16:02:26+01:00
status: 1
type: Concept
alternative label: casse-chocolat
alternative label: casse-noisettes
broader: T69-3957
definition: Instrument en bois ou en métal pour casser les noix ou les noisettes. Il se présente généralement sous la forme d'une pince, d'une tenaille, d’un marteau ou d’un réceptacle dans lequel vient pénétrer une vis qui écrase le fruit.
in scheme: T69
preferred label: nutcrackers @en-us