ciseaux à raisin
created: 2012-05-16T00:00:00+02:00
modified: 2014-10-16T15:32:40+02:00
status: 1
type: Concept
broader: T69-3957
definition: Ciseaux à courtes lames épaisses, parfois écartées, pour couper les tiges des grappes de raisin présentées sur la table ou pour les servir. Ils sont généralement décorés de grappes de raisin.
in scheme: T69
preferred label: grape shears @en-us