lame funéraire
created: 2012-05-16T00:00:00+02:00
modified: 2015-02-24T15:08:27+01:00
status: 1
type: Concept
broad match: Tombe
broad match: http://vocab.getty.edu/aat/300005923
broader: T69-394
definition: Feuille de métal, longue et peu épaisse, toujours rigide, fermant une plate-tombe. Elle peut être émaillée, peinte ou gravée et comporter une épitaphe.
in scheme: T69
preferred label: tomb slabs @en-us
preferred label: lastra tombale @it