hache à sucre
created: 2012-05-16T00:00:00+02:00
modified: 2014-10-16T15:41:26+02:00
status: 1
type: Concept
alternative label: marteau à sucre
alternative label: pique-sucre
broad match: http://data.bnf.fr/ark:/12148/cb137554066
broader: T69-3957
definition: Instrument en métal, en forme de hache, de marteau ou de pique, avec lequel on fend, casse ou débite un pain de sucre. La hache comporte une lame courbe, le marteau une pointe droite ou courbe.
in scheme: T69
preferred label: sugar cutters @en-us