sarcophage
created: 2012-05-16T00:00:00+02:00
modified: 2015-02-24T15:19:59+01:00
status: 1
type: Concept
broader: T69-377
definition: Cuve destinée à recevoir un ou plusieurs corps. Fermé d'un couvercle, le sarcophage est en pierre, en terre cuite ou en plâtre. Il comporte parfois un décor sculpté ou des inscriptions.
in scheme: T69
preferred label: sarcophagi (coffins) @en-us
preferred label: sarcofago @it
scope note: Le sarcophage peut être chrétien ou païen. Il peut être un élément constitutif d'un tombeau et ne joue alors qu'un rôle symbolique.