marque à beurre
created: 2012-05-16T00:00:00+02:00
modified: 2014-12-05T16:18:08+01:00
status: 1
type: Concept
alternative label: plaque à beurre
alternative label: rouleau à beurre
broader: T69-3957
definition: Rouleau, plaque ou gros cachet circulaire ou en amande, en bois ou en céramique, à décor en creux, que l'on applique sur la motte de beurre pour la décorer. Les motifs et inscriptions peuvent indiquer la provenance et parfois la quantité.
in scheme: T69
preferred label: butter prints @en-us