passoire à thé
created: 2012-05-16T00:00:00+02:00
modified: 2014-12-05T16:23:30+01:00
status: 1
type: Concept
alternative label: passe-thé
broad match: http://data.bnf.fr/ark:/12148/cb12469490f
broader: T69-3957
definition: Instrument en métal utilisé pour retenir les feuilles de thé à la sortie de la théière. Il est généralement constitué par un réceptacle circulaire muni d'un petit manche latéral, de deux oreilles horizontales ou d'une anse mobile pour le suspendre au goulot de la théière.
in scheme: T69
preferred label: tea strainers @en-us