pince à sucre
created: 2012-05-16T00:00:00+02:00
modified: 2014-10-16T15:56:50+02:00
status: 1
type: Concept
broader: T69-3957
definition: Pince en métal avec laquelle on sert les morceaux de sucre. De forme semblable à la pince à glace, elle présente à chacune de ses extrémités une petite spatule découpée ou non en griffes.
in scheme: T69
preferred label: sugar tongs @en-us