porte-couverts
terme associe: T69-4119
created: 2012-05-16T00:00:00+02:00
modified: 2014-10-16T15:58:58+02:00
status: 1
type: Concept
alternative label: casier à couverts
alternative label: plaque à couverts
alternative label: égouttoir à couverts
broad match: http://data.bnf.fr/ark:/12148/cb122111177
broader: T69-3957
definition: Récipient ou instrument ajouré en métal dans lequel on range verticalement les couverts, manche en bas. Le porte-couverts peut être d'applique, suspendu ou à poser.
in scheme: T69
narrow match: http://vocab.getty.edu/aat/300043089
preferred label: cutlery holders @en-us
related: T69-4119