rouleau à pâte
created: 2012-05-16T00:00:00+02:00
modified: 2014-12-05T16:34:26+01:00
status: 1
type: Concept
alternative label: laminoir à pâte
alternative label: rouleau à pâtisserie
broad match: cb11956938h
broader: T69-3957
definition: Instrument servant à étaler la pâte. Il se présente le plus souvent comme un cylindre muni ou non d'éléments de prise aux extrémités.
in scheme: T69
preferred label: rolling pins @en-us