bassin de table
terme associe: T69-1359
terme associe: T69-1363
terme associe: T69-1376
terme associe: T69-3890
created: 2012-05-16T00:00:00+02:00
modified: 2014-10-16T15:04:59+02:00
status: 1
type: Concept
broad match: http://data.bnf.fr/ark:/12148/cb11978277c
broad match: http://vocab.getty.edu/aat/300045614
broader: T69-4097
definition: Récipient circulaire plus ou moins profond, utilisé pour le lavage des mains avant et après les repas. Il accompagne l'aiguière, à laquelle il est assorti.
in scheme: T69
related: T69-1359
related: T69-1363
related: T69-1376
related: T69-3890