plateau
terme associe: T69-3803
terme associe: T69-3865
terme associe: T69-3887
terme associe: T69-3955
created: 2012-05-16T00:00:00+02:00
modified: 2014-12-05T15:49:40+01:00
status: 1
type: Concept
alternative label: plateau porte-verres
alternative label: plateau pour pots à crème
alternative label: plateau pour pots à jus
alternative label: plateau pour tasses à glace
broader: T69-4097
definition: Support comportant généralement un fond plat ou compartimenté et un rebord, parfois un ou plusieurs pieds et des éléments de prise, sur lequel on transporte et présente des aliments ou des boissons, des instruments, ou encore des récipients auxquels il est souvent assorti et qui forment avec lui un service.
in scheme: T69
preferred label: trays @en-us
related: T69-3803
related: T69-3865
related: T69-3887
related: T69-3955