présentoir
terme associe: T69-3881
created: 2012-05-16T00:00:00+02:00
modified: 2014-12-05T15:52:07+01:00
status: 1
type: Concept
broad match: http://data.bnf.fr/ark:/12148/cb155053551
broader: T69-4097
definition: Support pour présenter des objets ou des aliments ou encore servant de décor ou de surtout. Il se présente sous forme de socle, de plat ou de plateau.
in scheme: T69
related: T69-3881