rafraîchissoir à verre
created: 2012-05-16T00:00:00+02:00
modified: 2014-12-05T15:54:35+01:00
status: 1
type: Concept
alternative label: rafraîchissoir à verres
alternative label: seau à verres
broad match: http://data.bnf.fr/ark:/12148/cb144303016
broader: T69-4097
definition: Rafraîchissoir à fond plat ou arrondi, sur pied bas ou non et dont le bord supérieur comporte une ou plusieurs encoches servant à caler la jambe du ou des verres qui y trempent. Le rafraîchissoir à verre unique se différencie du rafraîchissoir à bouteille par la présence d'une encoche sur le bord. Il peut faire partie d'un surtout.
in scheme: T69
preferred label: wine-glass coolers @en-us