surtout de table
terme associe: T69-3803
terme associe: T69-3809
terme associe: T69-3825
terme associe: T69-3835
terme associe: T69-3837
terme associe: T69-3839
terme associe: T69-3875
terme associe: T69-3881
terme associe: T69-4144
created: 2012-05-16T00:00:00+02:00
modified: 2014-12-05T15:58:58+01:00
status: 1
type: Concept
alternative label: milieu de table
broader: T69-4097
definition: Objet ou ensemble d'objets disposés au centre d'une table dressée pour l'orner. Le surtout peut se composer d'un élément de grandes dimensions (plateau, vase, jardinière, etc.), seul ou accompagné de récipients ou d'accessoires (salière, boîte à épices, etc.). Il peut également comporter des éléments décoratifs (miroirs, personnages, animaux, éléments naturels ou architecturaux).
in scheme: T69
preferred label: epergnes @en-us
related: T69-3803
related: T69-3809
related: T69-3825
related: T69-3835
related: T69-3837
related: T69-3839
related: T69-3875
related: T69-3881
related: T69-4144