stèle
created: 2012-05-16T00:00:00+02:00
modified: 2015-02-24T15:33:52+01:00
status: 1
type: Concept
alternative label: cippe
alternative label: stèle funéraire
broader: T69-364
definition: Monument monolithe en forme de pierre dressée, funéraire, votif, juridique ou sacerdotal ayant pour fonction de conserver, par l'image et le texte, le souvenir d'événements ou de personnages.
in scheme: T69
preferred label: stelae @en-us
preferred label: stele funebre @it