pot à eau
created: 2012-05-16T00:00:00+02:00
modified: 2014-12-08T16:08:49+01:00
status: 1
type: Concept
alternative label: pot à eau de déjeuner
broad match: http://vocab.getty.edu/aat/300045685
broader: T69-3889
definition: Récipient verseur couvert pour le service de l'eau chaude destinée à la consommation du thé. Il comporte un goulot et une anse latérale verticale. Ce pot fait souvent partie d'un service ou d'un déjeuner.
in scheme: T69
preferred label: water jugs @en-us