objet pour l'entretien de la maison
created: 2012-05-16T00:00:00+02:00
modified: 2014-10-17T13:48:46+02:00
status: 1
type: Concept
alternative label: bâton à faire les lits
alternative label: chasse-mouches
alternative label: gobe-mouches
alternative label: protège-évier
alternative label: tapette à insectes
broader: T69-3577
definition: Ustensile destiné à l’hygiène d’un intérieur domestique.
in scheme: T69
narrower: T69-4343
narrower: T69-4345
narrower: T69-4349
narrower: T69-4351
narrower: T69-4353
narrower: T69-4356
narrower: T69-4360
narrower: T69-4361
narrower: T69-4363
narrower: T69-4367
narrower: T69-4369
narrower: T69-4371
preferred label: housekeeping equipment @en-us