baquet
created: 2012-05-16T00:00:00+02:00
modified: 2014-12-10T15:46:12+01:00
status: 1
type: Concept
alternative label: cuvier
alternative label: seille
alternative label: seille à traire
broader: T69-4340
definition: Vaste récipient à poignées, non couvert, destiné à transporter des liquides ou contenir l'eau de l'entretien (souvent la lessive).
in scheme: T69
preferred label: washtubs (housekeeping containers) @en-us