bâton à pain de cire
created: 2012-05-16T00:00:00+02:00
modified: 2014-10-17T13:51:33+02:00
status: 1
type: Concept
broad match: http://data.bnf.fr/ark:/12148/cb120733442
broad match: Bâton
broad match: http://vocab.getty.edu/aat/300162798
broader: T69-4340
definition: Manche en bois d'environ 1 m de long, terminé par une grosse pince en bois ou en métal dans laquelle on fixe un morceau de cire dure pour enduire les parquets.
in scheme: T69