brosse à meuble
created: 2012-05-16T00:00:00+02:00
modified: 2014-10-17T13:52:44+02:00
status: 1
type: Concept
alternative label: brosse passe-partout
alternative label: brosse pour capitons
broad match: http://data.bnf.fr/ark:/12148/cb11965878f
broad match: http://vocab.getty.edu/aat/300161423
broader: T69-4340
definition: Instrument, formé de fibres de même longueur ajustées dans une monture, de forme arrondi et muni d'une poignée ou d’un manche. La brosse à meuble sert à nettoyer, lustrer, entretenir le mobilier. Certaines sont aussi utilisées pour les tapis ou pour l'argenterie.
in scheme: T69