brûle-parfum
terme associe: T69-3138
created: 2012-05-16T00:00:00+02:00
modified: 2014-12-10T15:48:53+01:00
status: 1
type: Concept
alternative label: cassolette
alternative label: fleur à parfum
broader: T69-4340
definition: Récipient couvert dans lequel on place des braises pour brûler des matières aromatiques dont la fumée odoriférante s'échappe par des jours pratiqués dans le couvercle et le haut du corps.
in scheme: T69
preferred label: cassolettes @en-us
related: T69-3138