humidificateur
created: 2012-05-16T00:00:00+02:00
modified: 2014-10-17T13:57:15+02:00
status: 1
type: Concept
broader: T69-4340
definition: Récipient rempli d'eau et muni d'un couvercle ajouré, que l'on place au-dessus d'un poêle ou à proximité d’une source de chaleur pour humidifier l'air.
in scheme: T69
preferred label: humidifiers @en-us