seau
created: 2012-05-16T00:00:00+02:00
modified: 2014-12-10T16:01:37+01:00
status: 1
type: Concept
alternative label: dourne
alternative label: herrade
alternative label: seau à eau
broad match: cb11981075n
broader: T69-4340
definition: Récipient utilisé pour transporter et conserver l'eau. Le seau est cylindrique ou tronconique, à fond plat et muni d'une anse mobile sur le dessus. Certains seaux sont adaptés pour transporter l’eau sur la tête (dourne, herrade).
in scheme: T69
preferred label: buckets (vessels) @en-us