objet pour l'entretien du linge
created: 2012-05-16T00:00:00+02:00
modified: 2014-10-17T14:14:37+02:00
status: 1
type: Concept
alternative label: perche à étendre le linge
alternative label: pince à lessive
alternative label: pince à linge
alternative label: plaque à plisser
alternative label: platille
alternative label: pot à couler la lessive
alternative label: rouleau à plisser
broader: T69-3577
definition: Récipient ou instrument servant à laver, sécher ou repasser le linge.
in scheme: T69
narrower: T69-4376
narrower: T69-4378
narrower: T69-4380
narrower: T69-4382
narrower: T69-4384
narrower: T69-4386
narrower: T69-4388
narrower: T69-4390
narrower: T69-4400
narrower: T69-4406