battoir à linge
created: 2012-05-16T00:00:00+02:00
modified: 2014-12-10T16:02:25+01:00
status: 1
type: Concept
alternative label: battoir de mariage
broad match: http://data.bnf.fr/ark:/12148/cb15073638c
broader: T69-4375
definition: Épaisse plaque de bois, rectangulaire ou ovale, prolongée par un manche court, servant à taper le linge mouillé pour le laver.
in scheme: T69
preferred label: laundry beaters @en-us