chaufferette à fers
created: 2012-05-16T00:00:00+02:00
modified: 2014-12-10T16:05:49+01:00
status: 1
type: Concept
alternative label: cloche à fers
alternative label: fourneau de blanchisseuse
alternative label: réchaud à fers
broad match: http://data.bnf.fr/ark:/12148/cb11944438f
broader: T69-4375
definition: Instrument servant à chauffer les fers à repasser massifs, c’est-à-dire ne comportant pas de réceptacle pour les braises ou le combustible.
in scheme: T69