croix de chemin
created: 2012-05-16T00:00:00+02:00
modified: 2015-02-24T12:02:35+01:00
status: 1
type: Concept
alternative label: croix de carrefour
broader: T69-431
definition: Croix monumentale érigée en bordure d'une voie ou à un carrefour.
in scheme: T69
preferred label: wayside crosses @en-us
preferred label: croce viaria @it
scope note: Une croix de chemin in situ fait l'objet d'un dossier architecture. Elle ne fait l’objet d’un dossier objets mobiliers que si elle est déposée. Voir aussi le Thesaurus de la désignation des œuvres architecturales et des espaces aménagés.