croix de cimetière
created: 2012-05-16T00:00:00+02:00
modified: 2015-02-24T12:03:29+01:00
status: 1
type: Concept
broader: T69-431
definition: Croix monumentale érigée dans un cimetière.
in scheme: T69
preferred label: cemetery crosses @en-us
preferred label: croce cimiteriale @it
scope note: Une croix de cimetière in situ fait l'objet d'un dossier architecture. Elle ne fait l’objet d’un dossier objets mobiliers que si elle est déposée. Voir aussi le Thesaurus de la désignation des œuvres architecturales et des espaces aménagés.