instrument ou accessoire pour l'éclairage
created: 2012-05-16T00:00:00+02:00
modified: 2014-10-16T12:06:35+02:00
status: 1
type: Concept
alternative label: pelle à suif
alternative label: seau à mèche
broader: T69-3577
definition: Instrument ou accessoire lié à l'éclairage.
in scheme: T69
narrower: T69-1801
narrower: T69-4411
narrower: T69-4413
narrower: T69-4415
narrower: T69-4417
narrower: T69-4419
narrower: T69-4421
narrower: T69-4424
narrower: T69-4426
narrower: T69-4428
narrower: T69-4430
narrower: T69-4432
narrower: T69-4434
narrower: T69-4436
narrower: T69-4439
narrower: T69-4440
narrower: T69-4442
narrower: T69-4444
narrower: T69-4448
narrower: T69-4452
preferred label: lighting devices @en-us