cheminée de lampe
terme associe: T69-4356
created: 2012-05-16T00:00:00+02:00
modified: 2014-10-16T12:36:59+02:00
status: 1
type: Concept
alternative label: manchon de lampe
alternative label: verre de lampe
alternative label: verrine
broad match: cb11978573t
broad match: Lampe
broader: T69-4423
definition: Accessoire en verre de forme cylindrique protégeant la flamme d'une lampe.
in scheme: T69
preferred label: chimneys (lighting device components) @en-us
related: T69-4356